Home > Error In

error in tdl form voucher no parts

how to calculate percent error in volume

java.util.zip.zipexception: error in opening zip file jboss

error in loading dll access

Error In 1817

Error In Accessing Macintosh Code Page.check

Error In Advapi32.dll

how to fix server error in application runtime error

computational error

possible convergence problem: optim gave code = 1

Error In Apache Configuration File Httpd.conf

bison yyerror

bitlord page loading error

Error In C: Windows System32 Spool Drivers W32x86 3 Dlcjtime.dll

Error In C: Windows System32 Spool Drivers W32x86 3 Dlcctime.dll

Error In C Windows System32 Spool Drivers X64 3 Lxcftime Dll

Error In C Windows System32 Spool Drivers W32x86 3 Lxcftime Dll

data ontap vss hardware provider service missing

Error In Can Not Run Firewall.cpl

Error In Cim Layer

Error In Closing Fca Streams

Error In Changing Region Code Sku

bootstrap

Error In Directdb Dll

Error In Config Sys

Error In Compact Mail Rules Function 13 Type Mismatch

error in loading dll excel

Error In Decryption In Vista

Error In Cyclone Startup

Error In Creating File Object For

Error In Download Firewall.cpl

Error In Discovery Process Citrix

Error In Elite Comm

Error In Explorer.exe

due to an unidentified problem firewall xp

Error In Firewall.cpl Error

impdp ora-29913: error in executing odciexttablefetch callout

Error In Firewall.cpl

fatal error in gc cities skylines

Error In Getting The Context For The Crl

Error In Gdi Exe

compile error in hidden module excel 2010

gaussian error messages

getadaptersaddresses example

Error In Hotmail Page

word compile error in hidden module mac

compile error in hidden module excel 2013

compile error in hidden module excel 2013 windows 7 64 bit

Error In Iesetup.dll

hp 7310 carriage jam fix

Error In Igfxdev.dll

Error In Iesetup.dll Missing Entry Ieaccesssysinst

error in ioctl call memory card

Error In Inter-domain Link Between

Error In Iris Configuration

Error In Iso Image Format Memento

error in ioctl call chkdsk

the module was loaded but the call to dllregisterserver failed with error code 0x80004005

error in judgement synonym

Error In Kernelbase.dll

Error In Keymgr.dll

Error In Locking Authority File /home/pi/.xauthority

error in loading dll excel vba

Error In Locking Authority File /home/ubuntu/.xauthority

Error In Locking Authority File /usr/nx/home/nx/.xauthority

microsoft access error in loading dll

Error In Markup File 'mainwindow.xaml'

Error In Markup File 'window1.xaml'

Error In Markup File 'page1.xaml' Line 1 Position 7

mfc42.dll what is

Error In Module Rsql Of The Database Interface

compile error in hidden module: link word mac

Error In Mmsystem Dll

Error In Network Daemon Odbc

Error In Multicast Throttle Logic

Error In Msvcrt.dll

Error In Navigation Cache Task Caught

Error In Network Daemon Progress Odbc

Error In Navigation Cache Task Caught Phoenix

singular gradient nls

Error In Nmindexstoresvr.exe

Error In Option Spec

Error In Ntdll.dll

Error In Option Spec Test =s

Error In Os Hta Message

Error In Option Spec Long

Error In Pink And Restart !

error in plot.new() figure margins too large in r studio

increasing the size of the plots pane.

figure margins too large error in r

error in plot.window(...) : need finite 'xlim' values in r

Error In Predict.randomforest

Error In Python' Malloc() Memory Corruption

Error In Polygon Ring Not Closed

internal error in advanced node list ram

Error In Qry2

Error In Predict.rpart

Error In Reading The Model In File Spagobi. Server

quartz.dll download

tftpd32 error 10054

Error In Registry For Extension Exchange Extensions

xds output files

Error In Resource File Pada Dev Pascal

Error In Sdt Enlarge Check

Error In Setupx Dll

setupapi.dll is missing windows 7

error in service module linux login

sieve matches

Error In Rsql Module Of Database Interface

sensor characteristics pdf

Error In Sieve Filter Too Many Notifies Specified

Error In Shut Down Code In Applet

Error In Signal To Lucentike Isymphony

Error In Signal To Lucentike Viore Plasma

Error In Sieve Filter Outlook

Error In Signal To Lucentike Rc2002v

Error In Sieve Filter Notify Mailto

Error In Ml Win

Error In Sieve Filter Unknown Function/variable Found

Error In Sieve Filter Mac

Error In Signal To Lucentike Viore Remote

Error In Srclient.dll Windows 7

Error In Srclient.dll Windows Vista

Error In Signal To Lucentike HP Rc2002003\/01b

Error In The Libname Statement Sas 9.3

Error In Syssetup.dll

Error In The Internal Data Step 7

the instruction at referenced memory at could not be written windows 8

Error In Toad Class Not Registered

Error In The Libname Statement Sas 9.0

Error In The Unit Conversion. Error 111 Occurred

Error In The Unit Conversion Error 110 Occurred

Error In The Unit Conversion. Error 109 Occurred

thinking errors list

Error In Starting Automatic Update For Windows Xp 0x80070032

Error In Trust Deed

Error In Top Frame

Error In Timer 3 - Unrecognizable Format

Error In Tuxguitar No Acceptable Jvms Were Found

Error In Url.dll Missing Entry Fileprotocolhandler

error in user parameter list imovie

netsh.exe error when shutting down

error -50 paramerr: error in user parameter list

Error In User Exe

Error In Vb.net

err - error in getcommand: 0x80770004

Error In Wep4util.dll

Error In Vgx.dll

Error In Windows 2008 0x0000135

Error In Xpath /config/lucenematchversion For Solrconfig.xml

xmlhttprequest onerror

Error In Xml File Aborting Build

Error In Zip Archive 11

Error In Your Config Sys

Error In Zynga Poker

you have an error in your sql syntax check the manual that corresponds to your mysql server version

zipfldr.dll command line

in error meaning

Error In Registry For Exchange Extensions

Error In Registry For Extension

firefox

Error In Uploading Lxbbprp.dll Error

Error In User Parameter List Adobe Director

Error In Uploading Lxbbprp.dll

error in rep(1, n) : invalid 'times' argument glmnet

error relaunching virtualbox vm process 5 solved

 - 1